Target
Adenosine receptor A3
Ligand
BDBM50379118
Substrate
Meas. Tech.
ChEMBL_862921 (CHEMBL2174885)
Ki
110±n/a nM
Citation
 Tosh, DKPaoletta, SDeflorian, FPhan, KMoss, SMGao, ZGJiang, XJacobson, KA Structural sweet spot for A1 adenosine receptor activation by truncated (N)-methanocarba nucleosides: receptor docking and potent anticonvulsant activity. J Med Chem 55:8075-90 (2012)  
Target
Name:
Adenosine receptor A3
Synonyms:
A3 adenosine receptor (hA3) ADORA3 | Adenosine A3 receptor (A3AR)
Type:
G Protein-Coupled Receptor (GPCR)
Mol. Mass.:
36197.32
Organism:
Homo sapiens (Human)
Description:
P0DMS8
Residue:
318
  
Inhibitor
Name:
BDBM50379118
Synonyms:
CHEMBL2012685
Type:
Small organic molecule
Emp. Form.:
C16H20ClN5O2
Mol. Mass.:
349.815
SMILES:
CC(Nc1nc(Cl)nc2n(cnc12)[C@@H]1[C@H]2C[C@H]2[C@@H](O)[C@H]1O)C1CC1
: