Target
Histone-lysine N-methyltransferase SUV39H1
Ligand
BDBM50009672
Substrate
Meas. Tech.
ChEMBL_863116 (CHEMBL2175614)
Ki
4900±n/a nM
Citation
 Anglin, JLDeng, LYao, YCai, GLiu, ZJiang, HCheng, GChen, PDong, SSong, Y Synthesis and structure-activity relationship investigation of adenosine-containing inhibitors of histone methyltransferase DOT1L. J Med Chem 55:8066-74 (2012)  
Target
Name:
Histone-lysine N-methyltransferase SUV39H1
Synonyms:
H3-K9-HMTase 1 KMT1A Position-effect variegation 3-9 homolog SUV39H1 Su(var)3-9 homolog 1 | Suppressor of variegation 3-9 homolog 1
Type:
PROTEIN
Mol. Mass.:
47917.07
Organism:
Homo sapiens (Human)
Description:
ChEMBL_1473655
Residue:
412
  
Inhibitor
Name:
BDBM50009672
Synonyms:
AdoHcy S-(5'-adenosyl)-L-homocysteine S-[1-(adenin-9-yl)-1,5-dideoxy-beta-D-ribofuranos-5-yl]-L-homocysteine SAH US9175331, 1 | US9333217, S-Adenosyl-L-homocysteine (SAH)
Type:
Small organic molecule
Emp. Form.:
C14H20N6O5S
Mol. Mass.:
384.411
SMILES:
N[C@@H](CCSC[C@H]1O[C@H]([C@H](O)[C@@H]1O)n1cnc2c(N)ncnc12)C(O)=O
: