Target
Histone-lysine N-methyltransferase, H3 lysine-79 specific
Ligand
BDBM50396984
Substrate
Meas. Tech.
ChEMBL_863118 (CHEMBL2175616)
Ki
1000±n/a nM
Citation
 Anglin, JLDeng, LYao, YCai, GLiu, ZJiang, HCheng, GChen, PDong, SSong, Y Synthesis and structure-activity relationship investigation of adenosine-containing inhibitors of histone methyltransferase DOT1L. J Med Chem 55:8066-74 (2012)  
Target
Name:
Histone-lysine N-methyltransferase, H3 lysine-79 specific
Synonyms:
2.1.1.43 DOT1-like protein (Dot1L) DOT1L_HUMAN Histone H3-K79 methyltransferase Histone Methyltransferase DOT1L KIAA1814 Lysine N-methyltransferase 4
Type:
Protein
Mol. Mass.:
184911.91
Organism:
Homo sapiens (Human)
Description:
Q8TEK3
Residue:
1537
  
Inhibitor
Name:
BDBM50396984
Synonyms:
CHEMBL2171001
Type:
Small organic molecule
Emp. Form.:
C20H23F2N7O4S
Mol. Mass.:
495.503
SMILES:
Nc1ncnc2n(cnc12)[C@@H]1O[C@H](CSCCCNC(=O)Nc2ccc(F)cc2F)[C@@H](O)[C@H]1O
: