Target
Histone-lysine N-methyltransferase, H3 lysine-79 specific
Ligand
BDBM50397001
Substrate
Meas. Tech.
ChEMBL_863118 (CHEMBL2175616)
Ki
16000±n/a nM
Citation
 Anglin, JLDeng, LYao, YCai, GLiu, ZJiang, HCheng, GChen, PDong, SSong, Y Synthesis and structure-activity relationship investigation of adenosine-containing inhibitors of histone methyltransferase DOT1L. J Med Chem 55:8066-74 (2012)  
Target
Name:
Histone-lysine N-methyltransferase, H3 lysine-79 specific
Synonyms:
2.1.1.43 DOT1-like protein (Dot1L) DOT1L_HUMAN Histone H3-K79 methyltransferase Histone Methyltransferase DOT1L KIAA1814 Lysine N-methyltransferase 4
Type:
Protein
Mol. Mass.:
184911.91
Organism:
Homo sapiens (Human)
Description:
Q8TEK3
Residue:
1537
  
Inhibitor
Name:
BDBM50397001
Synonyms:
CHEMBL2170984
Type:
Small organic molecule
Emp. Form.:
C20H24N6O5S
Mol. Mass.:
460.507
SMILES:
Nc1ncnc2n(cnc12)[C@@H]1O[C@H](CSCCCOC(=O)Nc2ccccc2)[C@@H](O)[C@H]1O
: