Target
Protein arginine N-methyltransferase 1 [11-371]
Ligand
BDBM50397030
Substrate
Meas. Tech.
ChEMBL_863131 (CHEMBL2175629)
Ki
29700±n/a nM
Citation
 Wang, JChen, LSinha, SHLiang, ZChai, HMuniyan, SChou, YWYang, CYan, LFeng, YLi, KKLin, MFJiang, HZheng, YGLuo, C Pharmacophore-based virtual screening and biological evaluation of small molecule inhibitors for protein arginine methylation. J Med Chem 55:7978-87 (2012)  
Target
Name:
Protein arginine N-methyltransferase 1 [11-371]
Synonyms:
ANM1_HUMAN HRMT1L2 PRMT1 Protein arginine methyltransferase 1 (PRMT1) | Protein-arginine N-methyltransferase 1
Type:
Protein
Mol. Mass.:
41506.52
Organism:
Homo sapiens (Human)
Description:
Q99873[11-371]
Residue:
361
  
Inhibitor
Name:
BDBM50397030
Synonyms:
CHEMBL2171189
Type:
Small organic molecule
Emp. Form.:
C35H24N2O5
Mol. Mass.:
552.5755
SMILES:
Oc1ccc(cc1NC(=O)c1cccc2ccccc12)C(=O)c1ccc(O)c(NC(=O)c2cccc3ccccc23)c1
: