Target
Cannabinoid receptor 1
Ligand
BDBM50397396
Substrate
Meas. Tech.
ChEMBL_864943 (CHEMBL2175893)
Ki
548±n/a nM
Citation
 El Bakali, JGilleron, PBody-Malapel, MMansouri, RMuccioli, GGDjouina, MBarczyk, AKlupsch, FAndrzejak, VLipka, EFurman, CLambert, DMChavatte, PDesreumaux, PMillet, R 4-Oxo-1,4-dihydropyridines as selective CB2 cannabinoid receptor ligands. Part 2: discovery of new agonists endowed with protective effect against experimental colitis. J Med Chem 55:8948-52 (2012)  
Target
Name:
Cannabinoid receptor 1
Synonyms:
CANN6 CB-R CNR CNR1_HUMAN Cannabinoid receptor Cannabinoid receptor 1 (brain)
Type:
G Protein-Coupled Receptor (GPCR)
Mol. Mass.:
52868.96
Organism:
Homo sapiens (Human)
Description:
P21554
Residue:
472
  
Inhibitor
Name:
BDBM50397396
Synonyms:
CHEMBL2170550
Type:
Small organic molecule
Emp. Form.:
C27H42N2O2
Mol. Mass.:
426.6346
SMILES:
CCCCCn1cc(C(=O)NC(C)C23CC4CC(CC(C4)C2)C3)c(=O)cc1C(C)(C)C
: