Target
Adenosine receptor A3
Ligand
BDBM50397725
Substrate
Meas. Tech.
ChEMBL_874127 (CHEMBL2187068)
Ki
4.3±n/a nM
Citation
 Baraldi, PGPreti, DBorea, PAVarani, K Medicinal chemistry of A3 adenosine receptor modulators: pharmacological activities and therapeutic implications. J Med Chem 55:5676-703 (2012)  
Target
Name:
Adenosine receptor A3
Synonyms:
A3 adenosine receptor (hA3) ADORA3 | Adenosine A3 receptor (A3AR)
Type:
G Protein-Coupled Receptor (GPCR)
Mol. Mass.:
36197.32
Organism:
Homo sapiens (Human)
Description:
P0DMS8
Residue:
318
  
Inhibitor
Name:
BDBM50397725
Synonyms:
CHEMBL2177153
Type:
Small organic molecule
Emp. Form.:
C18H18ClIN6O3S
Mol. Mass.:
560.796
SMILES:
CNC(=O)[C@@]1(SC[C@H](O)[C@@H]1O)n1cnc2c(NCc3cccc(I)c3)nc(Cl)nc12
: