Target
Adenosine receptor A3
Ligand
BDBM50117215
Substrate
Meas. Tech.
ChEMBL_874127 (CHEMBL2187068)
Ki
0.95±n/a nM
Citation
 Baraldi, PGPreti, DBorea, PAVarani, K Medicinal chemistry of A3 adenosine receptor modulators: pharmacological activities and therapeutic implications. J Med Chem 55:5676-703 (2012)  
Target
Name:
Adenosine receptor A3
Synonyms:
A3 adenosine receptor (hA3) ADORA3 | Adenosine A3 receptor (A3AR)
Type:
G Protein-Coupled Receptor (GPCR)
Mol. Mass.:
36197.32
Organism:
Homo sapiens (Human)
Description:
P0DMS8
Residue:
318
  
Inhibitor
Name:
BDBM50117215
Synonyms:
5-Butyl-8-(4-trifluoromethyl-phenyl)-3H-[1,2,4]triazolo[5,1-i]purine | CHEMBL123705
Type:
Small organic molecule
Emp. Form.:
C17H15F3N6
Mol. Mass.:
360.3364
SMILES:
CCCCc1nc2nc[nH]c2c2nc(nn12)-c1ccc(cc1)C(F)(F)F
: