Target
Adenosine receptor A3
Ligand
BDBM50170132
Substrate
Meas. Tech.
ChEMBL_874127 (CHEMBL2187068)
Ki
0.8±n/a nM
Citation
 Baraldi, PGPreti, DBorea, PAVarani, K Medicinal chemistry of A3 adenosine receptor modulators: pharmacological activities and therapeutic implications. J Med Chem 55:5676-703 (2012)  
Target
Name:
Adenosine receptor A3
Synonyms:
A3 adenosine receptor (hA3) ADORA3 | Adenosine A3 receptor (A3AR)
Type:
G Protein-Coupled Receptor (GPCR)
Mol. Mass.:
36197.32
Organism:
Homo sapiens (Human)
Description:
P0DMS8
Residue:
318
  
Inhibitor
Name:
BDBM50170132
Synonyms:
1-Benzyl-7-methyl-3-propyl-1H,8H-imidazo[2,1-f]purine-2,4-dione | CHEMBL434534
Type:
Small organic molecule
Emp. Form.:
C18H19N5O2
Mol. Mass.:
337.3758
SMILES:
CCCn1c(=O)n(Cc2ccccc2)c2nc3[nH]c(C)cn3c2c1=O
: