Target
Beta-secretase 1
Ligand
BDBM50397740
Substrate
Meas. Tech.
ChEMBL_874329 (CHEMBL2182237)
IC50
1100000±n/a nM
Citation
 Efremov, IVVajdos, FFBorzilleri, KACapetta, SChen, HDorff, PHDutra, JKGoldstein, SWMansour, MMcColl, ANoell, SOborski, CEO'Connell, TNO'Sullivan, TJPandit, JWang, HWei, BWithka, JM Discovery and optimization of a novel spiropyrrolidine inhibitor ofß-secretase (BACE1) through fragment-based drug design. J Med Chem 55:9069-88 (2012)  
Target
Name:
Beta-secretase 1
Synonyms:
ASP2 Aspartyl protease 2 BACE1 Beta-secretase (BACE) Beta-secretase 1 (BACE 1) Beta-secretase 1 (BACE1) Beta-site amyloid precursor protein cleaving enzyme 1 Memapsin-2 beta-Secretase (BACE-1) | beta-Secretase (BACE1)
Type:
Protein
Mol. Mass.:
55755.10
Organism:
Homo sapiens (Human)
Description:
P56817
Residue:
501
  
Inhibitor
Name:
BDBM50397740
Synonyms:
CHEMBL2181988
Type:
Small organic molecule
Emp. Form.:
C11H12N2O
Mol. Mass.:
188.2258
SMILES:
O=C1Nc2ccccc2[C@]11CCNC1
: