Target
Advanced glycosylation end product-specific receptor
Ligand
BDBM50397836
Substrate
Meas. Tech.
ChEMBL_876296 (CHEMBL2185357)
Kd
102000±n/a nM
Citation
 Han, YTChoi, GISon, DKim, NJYun, HLee, SChang, DJHong, HSKim, HHa, HJKim, YHPark, HJLee, JSuh, YG Ligand-based design, synthesis, and biological evaluation of 2-aminopyrimidines, a novel series of receptor for advanced glycation end products (RAGE) inhibitors. J Med Chem 55:9120-35 (2012)  
Target
Name:
Advanced glycosylation end product-specific receptor
Synonyms:
AGER RAGE_HUMAN | Receptor for advanced glycosylation end products
Type:
PROTEIN
Mol. Mass.:
42800.11
Organism:
Homo sapiens (Human)
Description:
ChEMBL_1339877
Residue:
404
  
Inhibitor
Name:
BDBM50397836
Synonyms:
CHEMBL2179073
Type:
Small organic molecule
Emp. Form.:
C28H28Cl2N4O
Mol. Mass.:
507.454
SMILES:
CCN(CC)CCOc1cccc(Nc2nc(cc(n2)-c2ccc(Cl)cc2)-c2ccc(Cl)cc2)c1
: