Target
Protein mono-ADP-ribosyltransferase PARP14
Ligand
BDBM50397961
Substrate
Meas. Tech.
ChEMBL_872908 (CHEMBL2187439)
Kd
11200±n/a nM
Citation
 Andersson, CDKarlberg, TEkblad, TLindgren, AEThorsell, AGSpjut, SUciechowska, UNiemiec, MSWittung-Stafshede, PWeigelt, JElofsson, MSchüler, HLinusson, A Discovery of ligands for ADP-ribosyltransferases via docking-based virtual screening. J Med Chem 55:7706-18 (2012)  
Target
Name:
Protein mono-ADP-ribosyltransferase PARP14
Synonyms:
(ARTD8 or PARP14) 2.4.2.- ADP-ribosyltransferase diphtheria toxin-like 8 B aggressive lymphoma protein 2 BAL2  KIAA1268 PAR14_HUMAN PARP14 Synonyms=BAL2
Type:
Mol. Mass.:
202812.41
Organism:
Homo sapiens (Human)
Description:
Q460N5
Residue:
1801
  
Inhibitor
Name:
BDBM50397961
Synonyms:
CHEMBL2179988
Type:
Small organic molecule
Emp. Form.:
C11H10N2O4
Mol. Mass.:
234.2081
SMILES:
NC(=O)c1cccc(NC(=O)\C=C\C(O)=O)c1
: