Target
cAMP and cAMP-inhibited cGMP 3',5'-cyclic phosphodiesterase 10A
Ligand
BDBM50397965
Substrate
Meas. Tech.
ChEMBL_872920 (CHEMBL2187451)
IC50
14±n/a nM
Citation
 Chappie, TAHelal, CJHou, X Current landscape of phosphodiesterase 10A (PDE10A) inhibition. J Med Chem 55:7299-331 (2012)  
Target
Name:
cAMP and cAMP-inhibited cGMP 3',5'-cyclic phosphodiesterase 10A
Synonyms:
3',5'-cyclic phosphodiesterase PDE10_HUMAN Phosphodiesterase 10A
Type:
Protein
Mol. Mass.:
88412.52
Organism:
Homo sapiens (Human)
Description:
Q9Y233
Residue:
779
  
Inhibitor
Name:
BDBM50397965
Synonyms:
CHEMBL2180789
Type:
Small organic molecule
Emp. Form.:
C20H13F3N4O2
Mol. Mass.:
398.338
SMILES:
FC(F)(F)Oc1cccc(c1)-n1ccc(=O)c(n1)-c1ccnn1-c1ccccc1
: