Target
Serine/threonine-protein kinase ATR
Ligand
BDBM50341711
Substrate
Meas. Tech.
ChEMBL_873182 (CHEMBL2183413)
IC50
7300±n/a nM
Citation
 Finlay, MRGriffin, RJ Modulation of DNA repair by pharmacological inhibitors of the PIKK protein kinase family. Bioorg Med Chem Lett 22:5352-9 (2012)  
Target
Name:
Serine/threonine-protein kinase ATR
Synonyms:
ATR Ataxia telangiectasia and Rad3-related protein (ATR) FRP1 | Serine-protein kinase ATR
Type:
Protein
Mol. Mass.:
301404.58
Organism:
Homo sapiens (Human)
Description:
Q13535
Residue:
2644
  
Inhibitor
Name:
BDBM50341711
Synonyms:
CHEMBL479488 | schisandrin B
Type:
Small organic molecule
Emp. Form.:
C23H28O6
Mol. Mass.:
400.4648
SMILES:
COc1cc2CC(C)C(C)Cc3cc4OCOc4c(OC)c3-c2c(OC)c1OC
: