Target
Sigma non-opioid intracellular receptor 1
Ligand
BDBM50398057
Substrate
Meas. Tech.
ChEMBL_873466 (CHEMBL2186561)
Ki
0.960±n/a nM
Citation
 James, MLShen, BZavaleta, CLNielsen, CHMesangeau, CVuppala, PKChan, CAvery, BAFishback, JAMatsumoto, RRGambhir, SSMcCurdy, CRChin, FT New positron emission tomography (PET) radioligand for imagings-1 receptors in living subjects. J Med Chem 55:8272-82 (2012)  
Target
Name:
Sigma non-opioid intracellular receptor 1
Synonyms:
Opioid receptor SGMR1_RAT Sigma non-opioid intracellular receptor 1 Sigma-1 | Sigmar1
Type:
Enzyme Catalytic Domain
Mol. Mass.:
25266.54
Organism:
RAT
Description:
Q9R0C9
Residue:
223
  
Inhibitor
Name:
BDBM50398057
Synonyms:
CHEMBL2181924
Type:
Small organic molecule
Emp. Form.:
C18H25FN2OS
Mol. Mass.:
336.467
SMILES:
FCCCc1ccc2n(CCN3CCCCCC3)c(=O)sc2c1
: