Target
3-beta-hydroxysteroid-Delta(8),Delta(7)-isomerase
Ligand
BDBM50338990
Substrate
Meas. Tech.
ChEMBL_873432 (CHEMBL2186107)
Ki
1.7±n/a nM
Citation
 James, MLShen, BZavaleta, CLNielsen, CHMesangeau, CVuppala, PKChan, CAvery, BAFishback, JAMatsumoto, RRGambhir, SSMcCurdy, CRChin, FT New positron emission tomography (PET) radioligand for imagings-1 receptors in living subjects. J Med Chem 55:8272-82 (2012)  
Target
Name:
3-beta-hydroxysteroid-Delta(8),Delta(7)-isomerase
Synonyms:
3-beta-hydroxysteroid-Delta(8),Delta(7)-isomerase/Delta(24)-sterol reductase Anti-estrogen binding site (AEBS) D8-D7 sterol isomerase EBP Emopamil-binding protein
Type:
PROTEIN
Mol. Mass.:
26358.51
Organism:
Homo sapiens (Human)
Description:
ChEMBL_873432
Residue:
230
  
Inhibitor
Name:
BDBM50338990
Synonyms:
1-(3,4-dimethoxyphenethyl)-4-(3-phenylpropyl)piperazine CHEMBL408867 | N-phenylpropyl-N''-3,4-dimethoxyphenethyl piperazine
Type:
Small organic molecule
Emp. Form.:
C23H32N2O2
Mol. Mass.:
368.5124
SMILES:
COc1ccc(CCN2CCN(CCCc3ccccc3)CC2)cc1OC
: