Target
Toll-like receptor 8
Ligand
BDBM50398250
Substrate
Meas. Tech.
ChEMBL_874651 (CHEMBL2187099)
EC50
4270±n/a nM
Citation
 Salunke, DBYoo, EShukla, NMBalakrishna, RMalladi, SSSerafin, KJDay, VWWang, XDavid, SA Structure-activity relationships in human Toll-like receptor 8-active 2,3-diamino-furo[2,3-c]pyridines. J Med Chem 55:8137-51 (2012)  
Target
Name:
Toll-like receptor 8
Synonyms:
CD_antigen: CD288 TLR8_HUMAN | TRL8
Type:
Enzyme
Mol. Mass.:
119828.77
Organism:
Homo sapiens (Human)
Description:
Q9NR97
Residue:
1041
  
Inhibitor
Name:
BDBM50398250
Synonyms:
CHEMBL2177887
Type:
Small organic molecule
Emp. Form.:
C22H22N4O2
Mol. Mass.:
374.4357
SMILES:
C[C@H](Nc1oc2c(C)ncc(CO)c2c1Nc1ccccn1)c1ccccc1
: