Target
Toll-like receptor 8
Ligand
BDBM50398258
Substrate
Meas. Tech.
ChEMBL_874651 (CHEMBL2187099)
EC50
4910±n/a nM
Citation
 Salunke, DBYoo, EShukla, NMBalakrishna, RMalladi, SSSerafin, KJDay, VWWang, XDavid, SA Structure-activity relationships in human Toll-like receptor 8-active 2,3-diamino-furo[2,3-c]pyridines. J Med Chem 55:8137-51 (2012)  
Target
Name:
Toll-like receptor 8
Synonyms:
CD_antigen: CD288 TLR8_HUMAN | TRL8
Type:
Enzyme
Mol. Mass.:
119828.77
Organism:
Homo sapiens (Human)
Description:
Q9NR97
Residue:
1041
  
Inhibitor
Name:
BDBM50398258
Synonyms:
CHEMBL2177871
Type:
Small organic molecule
Emp. Form.:
C21H20N4O2
Mol. Mass.:
360.4091
SMILES:
Cc1ncc(CO)c2c(Nc3ccccn3)c(NCc3ccccc3)oc12
: