Target
Aromatase
Ligand
BDBM50398453
Substrate
Meas. Tech.
ChEMBL_872732 (CHEMBL2185145)
IC50
112.3±n/a nM
Citation
 Ghosh, DLo, JMorton, DValette, DXi, JGriswold, JHubbell, SEgbuta, CJiang, WAn, JDavies, HM Novel aromatase inhibitors by structure-guided design. J Med Chem 55:8464-76 (2012)  
Target
Name:
Aromatase
Synonyms:
ARO1 CP19A_HUMAN CYP19 CYPXIX Cytochrome P450 19A1 Cytochrome P450-C19 (CYP19) FL cytokine receptor precursor | P-450AROM
Type:
Enzyme
Mol. Mass.:
57888.92
Organism:
Homo sapiens (Human)
Description:
P11511
Residue:
503
  
Inhibitor
Name:
BDBM50398453
Synonyms:
CHEMBL2179109
Type:
Small organic molecule
Emp. Form.:
C23H28O3
Mol. Mass.:
352.4666
SMILES:
CC#CCO[C@@H]1C[C@H]2[C@@H]3CCC(=O)[C@@]3(C)CC[C@@H]2[C@@]2(C)C=CC(=O)C=C12
: