Target
Beta-secretase 1
Ligand
BDBM50398768
Substrate
Meas. Tech.
ChEMBL_872806 (CHEMBL2186065)
IC50
24±n/a nM
Citation
 Gravenfors, YViklund, JBlid, JGinman, TKarlström, SKihlström, JKolmodin, KLindström, Jvon Berg, Svon Kieseritzky, FBogar, KSlivo, CSwahn, BMOlsson, LLJohansson, PEketjäll, SFälting, JJeppsson, FStrömberg, KJanson, JRahm, F New aminoimidazoles asß-secretase (BACE-1) inhibitors showing amyloid-ß (Aß) lowering in brain. J Med Chem 55:9297-311 (2012)  
Target
Name:
Beta-secretase 1
Synonyms:
ASP2 Aspartyl protease 2 BACE1 Beta-secretase (BACE) Beta-secretase 1 (BACE 1) Beta-secretase 1 (BACE1) Beta-site amyloid precursor protein cleaving enzyme 1 Memapsin-2 beta-Secretase (BACE-1) | beta-Secretase (BACE1)
Type:
Protein
Mol. Mass.:
55755.10
Organism:
Homo sapiens (Human)
Description:
P56817
Residue:
501
  
Inhibitor
Name:
BDBM50398768
Synonyms:
CHEMBL2180030
Type:
Small organic molecule
Emp. Form.:
C23H23N5O
Mol. Mass.:
385.4616
SMILES:
COc1c(C)cc(cc1C)[C@]1(N=C(C)C(N)=N1)c1cccc(c1)-c1cncnc1
: