Target
Glutamate receptor ionotropic, NMDA 2B
Ligand
BDBM50398921
Substrate
Meas. Tech.
ChEMBL_874795 (CHEMBL2188839)
Ki
>100000±n/a nM
Citation
 Simoni, EDaniele, SBottegoni, GPizzirani, DTrincavelli, MLGoldoni, LTarozzo, GReggiani, AMartini, CPiomelli, DMelchiorre, CRosini, MCavalli, A Combining galantamine and memantine in multitargeted, new chemical entities potentially useful in Alzheimer's disease. J Med Chem 55:9708-21 (2012)  
Target
Name:
Glutamate receptor ionotropic, NMDA 2B
Synonyms:
GluN2B Grin2b NMDA receptor subunit N2B (GluN2B) NMDE2_RAT | NR2B
Type:
Protein
Mol. Mass.:
166077.66
Organism:
Rattus norvegicus (Rat)
Description:
Q00960
Residue:
1482
  
Inhibitor
Name:
BDBM50398921
Synonyms:
CHEMBL2178791
Type:
Small organic molecule
Emp. Form.:
C34H50N2O5
Mol. Mass.:
566.7712
SMILES:
COc1ccc2CN(CCOCCOCCNC34CC5CC(C)(CC(C)(C5)C3)C4)CC[C@@]34C=C[C@H](O)C[C@@H]3Oc1c24
: