Target
Estrogen receptor
Ligand
BDBM50398937
Substrate
Meas. Tech.
ChEMBL_874808 (CHEMBL2188852)
EC50
23±n/a nM
Citation
 Schäfer, AWellner, AStrauss, MSchäfer, AWolber, GGust, R Influence of chlorine or fluorine substitution on the estrogenic properties of 1-alkyl-2,3,5-tris(4-hydroxyphenyl)-1H-pyrroles. J Med Chem 55:9607-18 (2012)  
Target
Name:
Estrogen receptor
Synonyms:
ER ESR ESR1_HUMAN Estrogen receptor Estrogen receptor (ER-alpha) Estrogen receptor alpha (ER) Nuclear receptor subfamily 3 group A member 1
Type:
Protein
Mol. Mass.:
66230.44
Organism:
Homo sapiens (Human)
Description:
P03372
Residue:
595
  
Inhibitor
Name:
BDBM50398937
Synonyms:
CHEMBL2178793
Type:
Small organic molecule
Emp. Form.:
C25H20F3NO3
Mol. Mass.:
439.4264
SMILES:
CCCn1c(cc(c1-c1ccc(O)cc1F)-c1ccc(O)cc1F)-c1ccc(O)cc1F
: