Target
Macrophage migration inhibitory factor
Ligand
BDBM50399064
Substrate
Meas. Tech.
ChEMBL_878773 (CHEMBL2183713)
Ki
67600±n/a nM
Citation
 Dahlgren, MKGarcia, ABHare, AATirado-Rives, JLeng, LBucala, RJorgensen, WL Virtual screening and optimization yield low-nanomolar inhibitors of the tautomerase activity of Plasmodium falciparum macrophage migration inhibitory factor. J Med Chem 55:10148-59 (2012)  
Target
Name:
Macrophage migration inhibitory factor
Synonyms:
Macrophage migration inhibitory factor (MIF)
Type:
Enzyme
Mol. Mass.:
12844.38
Organism:
Plasmodium falciparum
Description:
Q6Q3H7
Residue:
116
  
Inhibitor
Name:
BDBM50399064
Synonyms:
CHEMBL2178838
Type:
Small organic molecule
Emp. Form.:
C17H13NO3
Mol. Mass.:
279.29
SMILES:
Oc1ccc(cc1)-c1ccc(Oc2cccc(O)c2)cn1
: