Target
Macrophage migration inhibitory factor
Ligand
BDBM50399073
Substrate
Meas. Tech.
ChEMBL_878773 (CHEMBL2183713)
Ki
25400±n/a nM
Citation
 Dahlgren, MKGarcia, ABHare, AATirado-Rives, JLeng, LBucala, RJorgensen, WL Virtual screening and optimization yield low-nanomolar inhibitors of the tautomerase activity of Plasmodium falciparum macrophage migration inhibitory factor. J Med Chem 55:10148-59 (2012)  
Target
Name:
Macrophage migration inhibitory factor
Synonyms:
Macrophage migration inhibitory factor (MIF)
Type:
Enzyme
Mol. Mass.:
12844.38
Organism:
Plasmodium falciparum
Description:
Q6Q3H7
Residue:
116
  
Inhibitor
Name:
BDBM50399073
Synonyms:
CHEMBL2178867
Type:
Small organic molecule
Emp. Form.:
C21H17N5O2S
Mol. Mass.:
403.457
SMILES:
NC(=O)CSc1nc2ccccc2c2nc(Cc3c[nH]c4ccccc34)c(O)n12
: