Target
C-type lectin domain family 4 member C
Ligand
BDBM50399362
Substrate
Meas. Tech.
ChEMBL_877660 (CHEMBL2185439)
IC50
1000000±n/a nM
Citation
 Scharenberg, MSchwardt, ORabbani, SErnst, B Target Selectivity of FimH Antagonists. J Med Chem 55:9810-6 (2012)  
Target
Name:
C-type lectin domain family 4 member C
Synonyms:
BDCA-2 Blood dendritic cell antigen 2 CD_antigen=CD303 CLEC4C CLECSF7 Dendritic lectin | HECL
Type:
PROTEIN
Mol. Mass.:
25039.29
Organism:
Homo sapiens (Human)
Description:
ChEMBL_877660
Residue:
213
  
Inhibitor
Name:
BDBM50399362
Synonyms:
CHEMBL1852236
Type:
Small organic molecule
Emp. Form.:
C19H20O8
Mol. Mass.:
376.3573
SMILES:
OC[C@H]1O[C@H](Oc2ccc(cc2)-c2ccc(cc2)C(O)=O)[C@@H](O)[C@@H](O)[C@@H]1O
: