Target
Breakpoint cluster region protein/Tyrosine-protein kinase ABL1
Ligand
BDBM50399375
Substrate
Meas. Tech.
ChEMBL_877761 (CHEMBL2186859)
IC50
0.52±n/a nM
Citation
 Li, YShen, MZhang, ZLuo, JPan, XLu, XLong, HWen, DZhang, FLeng, FLi, YTu, ZRen, XDing, K Design, synthesis, and biological evaluation of 3-(1H-1,2,3-triazol-1-yl)benzamide derivatives as Potent Pan Bcr-Abl inhibitors including the threonine(315)¿isoleucine(315) mutant. J Med Chem 55:10033-46 (2012)  
Target
Name:
Breakpoint cluster region protein/Tyrosine-protein kinase ABL1
Synonyms:
Bcr-Abl Breakpoint cluster region protein /Tyrosine-protein kinase ABL | Tyrosine-protein kinase ABL1/Breakpoint cluster region protein
Type:
Enzyme
Mol. Mass.:
Description:
Components:
This complex has 2 components.
Component 1
Name:
Tyrosine-protein kinase ABL1
Synonyms:
ABL ABL1_HUMAN JTK7 Proto-oncogene tyrosine-protein kinase ABL1 Tyrosine-protein kinase ABL V-abl Abelson murine leukemia viral oncogene homolog 1 p150 | tyrosine-protein kinase ABL1 isoform a
Type:
Enzyme
Mol. Mass.:
122897.30
Organism:
Homo sapiens (Human)
Description:
P00519
Residue:
1130
  
Component 2
Name:
Breakpoint cluster region protein
Synonyms:
BCR BCR_HUMAN Breakpoint cluster region protein | D22S11
Type:
PROTEIN
Mol. Mass.:
142824.75
Organism:
Homo sapiens (Human)
Description:
ChEMBL_305348
Residue:
1271
  
Inhibitor
Name:
BDBM50399375
Synonyms:
CHEMBL2178269
Type:
Small organic molecule
Emp. Form.:
C34H37F3N10O
Mol. Mass.:
658.7192
SMILES:
CN1CCN(CC1)C1CCN(Cc2ccc(NC(=O)c3ccc(C)c(c3)-n3cc(nn3)-c3cnc4[nH]ncc4c3)cc2C(F)(F)F)CC1
: