Target
Breakpoint cluster region protein/Tyrosine-protein kinase ABL1
Ligand
BDBM50399394
Substrate
Meas. Tech.
ChEMBL_877761 (CHEMBL2186859)
IC50
0.54±n/a nM
Citation
 Li, YShen, MZhang, ZLuo, JPan, XLu, XLong, HWen, DZhang, FLeng, FLi, YTu, ZRen, XDing, K Design, synthesis, and biological evaluation of 3-(1H-1,2,3-triazol-1-yl)benzamide derivatives as Potent Pan Bcr-Abl inhibitors including the threonine(315)¿isoleucine(315) mutant. J Med Chem 55:10033-46 (2012)  
Target
Name:
Breakpoint cluster region protein/Tyrosine-protein kinase ABL1
Synonyms:
Bcr-Abl Breakpoint cluster region protein /Tyrosine-protein kinase ABL | Tyrosine-protein kinase ABL1/Breakpoint cluster region protein
Type:
Enzyme
Mol. Mass.:
Description:
Components:
This complex has 2 components.
Component 1
Name:
Tyrosine-protein kinase ABL1
Synonyms:
ABL ABL1_HUMAN JTK7 Proto-oncogene tyrosine-protein kinase ABL1 Tyrosine-protein kinase ABL V-abl Abelson murine leukemia viral oncogene homolog 1 p150 | tyrosine-protein kinase ABL1 isoform a
Type:
Enzyme
Mol. Mass.:
122897.30
Organism:
Homo sapiens (Human)
Description:
P00519
Residue:
1130
  
Component 2
Name:
Breakpoint cluster region protein
Synonyms:
BCR BCR_HUMAN Breakpoint cluster region protein | D22S11
Type:
PROTEIN
Mol. Mass.:
142824.75
Organism:
Homo sapiens (Human)
Description:
ChEMBL_305348
Residue:
1271
  
Inhibitor
Name:
BDBM50399394
Synonyms:
CHEMBL2177634
Type:
Small organic molecule
Emp. Form.:
C28H30F3N9O
Mol. Mass.:
565.5927
SMILES:
CNc1ncc(cn1)-c1cn(nn1)-c1cc(ccc1C)C(=O)Nc1ccc(CN2CCN(C)CC2)c(c1)C(F)(F)F
: