Target
Histone deacetylase 8
Ligand
BDBM50399673
Substrate
Meas. Tech.
ChEMBL_878900 (CHEMBL2185051)
IC50
100±n/a nM
Citation
 Suzuki, TOta, YRi, MBando, MGotoh, AItoh, YTsumoto, HTatum, PRMizukami, TNakagawa, HIida, SUeda, RShirahige, KMiyata, N Rapid discovery of highly potent and selective inhibitors of histone deacetylase 8 using click chemistry to generate candidate libraries. J Med Chem 55:9562-75 (2012)  
Target
Name:
Histone deacetylase 8
Synonyms:
HD8 HDAC8_HUMAN Histone deacetylase 8 (HDAC-8) | Human HDAC8
Type:
Enzyme
Mol. Mass.:
41749.60
Organism:
Homo sapiens (Human)
Description:
Q9BY41
Residue:
377
  
Inhibitor
Name:
BDBM50399673
Synonyms:
CHEMBL2178343
Type:
Small organic molecule
Emp. Form.:
C15H14N4O2S
Mol. Mass.:
314.362
SMILES:
ONC(=O)c1cccc(c1)-c1cn(CCc2ccsc2)nn1
: