Target
Diacylglycerol O-acyltransferase 1
Ligand
BDBM50399698
Substrate
Meas. Tech.
ChEMBL_876789 (CHEMBL2183606)
IC50
>9100±n/a nM
Citation
 Barlind, JGBauer, UABirch, AMBirtles, SBuckett, LKButlin, RJDavies, RDEriksson, JWHammond, CDHovland, RJohannesson, PJohansson, MJKemmitt, PDLindmark, BTMorentin Gutierrez, PNoeske, TANordin, AO'Donnell, CJPetersson, AURedzic, ATurnbull, AVVinblad, J Design and optimization of pyrazinecarboxamide-based inhibitors of diacylglycerol acyltransferase 1 (DGAT1) leading to a clinical candidate dimethylpyrazinecarboxamide phenylcyclohexylacetic acid (AZD7687). J Med Chem 55:10610-29 (2012)  
Target
Name:
Diacylglycerol O-acyltransferase 1
Synonyms:
ACAT-related gene product 1 Acyl coA-diacylglycerol acyl transferase 1 (DGAT1) DGAT1 Diacylglycerol Acyltransferase (DGAT1) Diacylglycerol O-acyltransferase 1 (DGAT1) | Diglyceride acyltransferase
Type:
Protein
Mol. Mass.:
55297.82
Organism:
Homo sapiens (Human)
Description:
O75907
Residue:
488
  
Inhibitor
Name:
BDBM50399698
Synonyms:
CHEMBL2178930
Type:
Small organic molecule
Emp. Form.:
C22H27N3O3
Mol. Mass.:
381.4681
SMILES:
CCc1nc(C)c(nc1-c1ccc(cc1)[C@H]1CC[C@H](CC(O)=O)CC1)C(N)=O
: