Target
11-beta-hydroxysteroid dehydrogenase 1
Ligand
BDBM50400175
Substrate
Meas. Tech.
ChEMBL_878466 (CHEMBL2187380)
IC50
23±n/a nM
Citation
 Goldberg, FWLeach, AGScott, JSSnelson, WLGroombridge, SDDonald, CSBennett, SNBodin, CGutierrez, PMGyte, AC Free-Wilson and structural approaches to co-optimizing human and rodent isoform potency for 11ß-hydroxysteroid dehydrogenase type 1 (11ß-HSD1) inhibitors. J Med Chem 55:10652-61 (2012)  
Target
Name:
11-beta-hydroxysteroid dehydrogenase 1
Synonyms:
11-DH 11-beta-Hydroxysteroid Dehydrogenase 1 (11-beta-HSD1) 11-beta-hydroxysteroid dehydrogenase 1 (11HSD1) Corticosteroid 11-beta-dehydrogenase isozyme 1 (11-beta-HSD-1) Corticosteroid 11-beta-dehydrogenase isozyme 1 (11beta-HSD1) HSD11 HSD11L | SDR26C1
Type:
Enzyme
Mol. Mass.:
32409.16
Organism:
Homo sapiens (Human)
Description:
P28845
Residue:
292
  
Inhibitor
Name:
BDBM50400175
Synonyms:
CHEMBL2179018
Type:
Small organic molecule
Emp. Form.:
C25H36N4O3
Mol. Mass.:
440.5783
SMILES:
O[C@@]12CC3CC(C1)[C@H](NC(=O)c1cnc(NC4CCOCC4)nc1C1CCCC1)C(C3)C2
: