Target
D(3) dopamine receptor
Ligand
BDBM50116766
Substrate
Meas. Tech.
ChEMBL_879545 (CHEMBL2208954)
Ki
0.45±n/a nM
Citation
 Chen, JCollins, GTLevant, BWoods, JDeschamps, JRWang, S CJ-1639: A Potent and Highly Selective Dopamine D3 Receptor Full Agonist. ACS Med Chem Lett 2:620-625 (2011)  
Target
Name:
D(3) dopamine receptor
Synonyms:
DOPAMINE D3 Dopamine D3 receptor | Drd3
Type:
Protein
Mol. Mass.:
49540.58
Organism:
Rattus norvegicus (Rat)
Description:
P19020
Residue:
446
  
Inhibitor
Name:
BDBM50116766
Synonyms:
(-)-Pramipexole 2,6-Benzothiazolediamine, 4,5,6,7-tetrahydro-N(sup 6)-propyl-, (S)- PRAMIPEXOLE | cid_119570
Type:
Small organic molecule
Emp. Form.:
C10H17N3S
Mol. Mass.:
211.327
SMILES:
CCCN[C@H]1CCc2nc(N)sc2C1
: