Target
Sigma non-opioid intracellular receptor 1
Ligand
BDBM50028094
Substrate
Meas. Tech.
ChEMBL_880516 (CHEMBL2211451)
Ki
57±n/a nM
Citation
 Yu, LFZhang, HKGunosewoyo, HKozikowski, AP From a4ß2 Nicotinic Ligands to the Discovery of s1 Receptor Ligands: Pharmacophore Analysis and Rational Design. ACS Med Chem Lett 3:1054-1058 (2012)  
Target
Name:
Sigma non-opioid intracellular receptor 1
Synonyms:
Aging-associated gene 8 protein SGMR1_HUMAN SIGMAR1 SR31747-binding protein Sigma 1-type opioid receptor Sigma1R | hSigmaR1
Type:
Enzyme Catalytic Domain
Mol. Mass.:
25124.85
Organism:
Homo sapiens (Human)
Description:
Q99720
Residue:
223
  
Inhibitor
Name:
BDBM50028094
Synonyms:
(1S,4S)-4-(3,4-dichlorophenyl)-N-methyl-1,2,3,4-tetrahydronaphthalen-1-amine CHEMBL809 | SERTRALINE
Type:
Small organic molecule
Emp. Form.:
C17H17Cl2N
Mol. Mass.:
306.23
SMILES:
CN[C@H]1CC[C@@H](c2ccc(Cl)c(Cl)c2)c2ccccc12
: