Target
Histone-lysine N-methyltransferase EZH2
Ligand
BDBM50400781
Substrate
Meas. Tech.
ChEMBL_879124 (CHEMBL2209069)
IC50
79±n/a nM
Citation
 Verma, SKTian, XLaFrance, LVDuquenne, CSuarez, DPNewlander, KARomeril, SPBurgess, JLGrant, SWBrackley, JAGraves, APScherzer, DAShu, AThompson, COtt, HMAller, GSMachutta, CADiaz, EJiang, YJohnson, NWKnight, SDKruger, RGMcCabe, MTDhanak, DTummino, PJCreasy, CLMiller, WH Identification of Potent, Selective, Cell-Active Inhibitors of the Histone Lysine Methyltransferase EZH2. ACS Med Chem Lett 3:1091-1096 (2012)  
Target
Name:
Histone-lysine N-methyltransferase EZH2
Synonyms:
ENX-1 EZH2_HUMAN Histone-lysine N-methyltransferase EZH2 Lysine N-methyltransferase 6
Type:
Protein
Mol. Mass.:
85367.84
Organism:
Homo sapiens (Human)
Description:
Q15910
Residue:
746
  
Inhibitor
Name:
BDBM50400781
Synonyms:
CHEMBL2204997
Type:
Small organic molecule
Emp. Form.:
C31H39N7O2
Mol. Mass.:
541.6871
SMILES:
CCCc1cc(C)[nH]c(=O)c1CNC(=O)c1cc(cc2n(ncc12)C(C)C)-c1ccc(nc1)N1CCN(C)CC1
: