Target
Histone-lysine N-methyltransferase EZH2
Ligand
BDBM50400783
Substrate
Meas. Tech.
ChEMBL_879124 (CHEMBL2209069)
IC50
10632±n/a nM
Citation
 Verma, SKTian, XLaFrance, LVDuquenne, CSuarez, DPNewlander, KARomeril, SPBurgess, JLGrant, SWBrackley, JAGraves, APScherzer, DAShu, AThompson, COtt, HMAller, GSMachutta, CADiaz, EJiang, YJohnson, NWKnight, SDKruger, RGMcCabe, MTDhanak, DTummino, PJCreasy, CLMiller, WH Identification of Potent, Selective, Cell-Active Inhibitors of the Histone Lysine Methyltransferase EZH2. ACS Med Chem Lett 3:1091-1096 (2012)  
Target
Name:
Histone-lysine N-methyltransferase EZH2
Synonyms:
ENX-1 EZH2_HUMAN Histone-lysine N-methyltransferase EZH2 Lysine N-methyltransferase 6
Type:
Protein
Mol. Mass.:
85367.84
Organism:
Homo sapiens (Human)
Description:
Q15910
Residue:
746
  
Inhibitor
Name:
BDBM50400783
Synonyms:
CHEMBL1608462
Type:
Small organic molecule
Emp. Form.:
C21H25N5O2
Mol. Mass.:
379.4555
SMILES:
CC(C)n1ncc2c(cc(nc12)C1CC1)C(=O)NCc1c(C)cc(C)[nH]c1=O
: