Target
Histone-lysine N-methyltransferase SETD7
Ligand
BDBM50400778
Substrate
Meas. Tech.
ChEMBL_879135 (CHEMBL2209106)
IC50
63000±n/a nM
Citation
 Verma, SKTian, XLaFrance, LVDuquenne, CSuarez, DPNewlander, KARomeril, SPBurgess, JLGrant, SWBrackley, JAGraves, APScherzer, DAShu, AThompson, COtt, HMAller, GSMachutta, CADiaz, EJiang, YJohnson, NWKnight, SDKruger, RGMcCabe, MTDhanak, DTummino, PJCreasy, CLMiller, WH Identification of Potent, Selective, Cell-Active Inhibitors of the Histone Lysine Methyltransferase EZH2. ACS Med Chem Lett 3:1091-1096 (2012)  
Target
Name:
Histone-lysine N-methyltransferase SETD7
Synonyms:
Histone-lysine N-methyltransferase SETD7 KMT7 SET7 SETD7 | SETD7_HUMAN
Type:
Enzyme
Mol. Mass.:
40691.12
Organism:
Homo sapiens (Human)
Description:
Q8WTS6
Residue:
366
  
Inhibitor
Name:
BDBM50400778
Synonyms:
CHEMBL2204995
Type:
Small organic molecule
Emp. Form.:
C31H39N7O2
Mol. Mass.:
541.6871
SMILES:
CCCc1cc(C)[nH]c(=O)c1CNC(=O)c1cc(cc2n(ncc12)C(C)C)-c1ccnc(c1)N1CCN(C)CC1
: