Target
Protein arginine N-methyltransferase 3 [N508S]
Ligand
BDBM50400781
Substrate
Meas. Tech.
ChEMBL_879138 (CHEMBL2209109)
IC50
54000±n/a nM
Citation
 Verma, SKTian, XLaFrance, LVDuquenne, CSuarez, DPNewlander, KARomeril, SPBurgess, JLGrant, SWBrackley, JAGraves, APScherzer, DAShu, AThompson, COtt, HMAller, GSMachutta, CADiaz, EJiang, YJohnson, NWKnight, SDKruger, RGMcCabe, MTDhanak, DTummino, PJCreasy, CLMiller, WH Identification of Potent, Selective, Cell-Active Inhibitors of the Histone Lysine Methyltransferase EZH2. ACS Med Chem Lett 3:1091-1096 (2012)  
Target
Name:
Protein arginine N-methyltransferase 3 [N508S]
Synonyms:
ANM3_HUMAN Heterogeneous nuclear ribonucleoprotein methyltransferase-like protein 3 Protein arginine N-methyltransferase 3 | Protein arginine N-methyltransferase 3 (PRMT3)
Type:
Protein
Mol. Mass.:
59859.85
Organism:
Homo sapiens (Human)
Description:
O60678[N508S]
Residue:
531
  
Inhibitor
Name:
BDBM50400781
Synonyms:
CHEMBL2204997
Type:
Small organic molecule
Emp. Form.:
C31H39N7O2
Mol. Mass.:
541.6871
SMILES:
CCCc1cc(C)[nH]c(=O)c1CNC(=O)c1cc(cc2n(ncc12)C(C)C)-c1ccc(nc1)N1CCN(C)CC1
: