Target
Sodium-dependent noradrenaline transporter
Ligand
BDBM82071
Substrate
Meas. Tech.
ChEMBL_879332 (CHEMBL2208730)
IC50
149±n/a nM
Citation
 Meanwell, NA Synopsis of some recent tactical application of bioisosteres in drug design. J Med Chem 54:2529-91 (2011)  
Target
Name:
Sodium-dependent noradrenaline transporter
Synonyms:
Monoamine transporter NET Noradrenaline Transporter (NET) Norepinephrine transporter protein (NET) SLC6A2 Sodium-dependent noradrenaline transporter (NET) | Solute carrier family 6 member 2
Type:
Multi-pass membrane protein
Mol. Mass.:
69337.72
Organism:
Homo sapiens (Human)
Description:
P23975
Residue:
617
  
Inhibitor
Name:
BDBM82071
Synonyms:
CAS_93413-69-5 NSC_62923 Venlafaxine hydrochloride WY-45655
Type:
Small organic molecule
Emp. Form.:
C17H27NO2
Mol. Mass.:
277.4018
SMILES:
COc1ccc(cc1)C(CN(C)C)C1(O)CCCCC1
: