Target
Prostaglandin E2 receptor EP3 subtype
Ligand
BDBM50400818
Substrate
Meas. Tech.
ChEMBL_879335 (CHEMBL2208733)
Ki
2.1±n/a nM
Citation
 Meanwell, NA Synopsis of some recent tactical application of bioisosteres in drug design. J Med Chem 54:2529-91 (2011)  
Target
Name:
Prostaglandin E2 receptor EP3 subtype
Synonyms:
PE2R3_HUMAN PGE2-R Prostaglandin E2 receptor Prostaglandin E2 receptor EP3 subtype (EP3) Prostaglandin E2 receptor EP3D subtype (EP3D) | Prostanoid EP3 receptor
Type:
Enzyme
Mol. Mass.:
43335.03
Organism:
Homo sapiens (Human)
Description:
P43115
Residue:
390
  
Inhibitor
Name:
BDBM50400818
Synonyms:
CHEMBL2204339
Type:
Small organic molecule
Emp. Form.:
C23H17NO5S3
Mol. Mass.:
483.58
SMILES:
O=C(NS(=O)(=O)c1cccs1)\C=C\c1ccccc1S(=O)(=O)c1ccc2ccccc2c1
: