Target
Angiotensin-converting enzyme
Ligand
BDBM50146423
Substrate
Meas. Tech.
ChEMBL_879312 (CHEMBL2208710)
IC50
72±n/a nM
Citation
 Meanwell, NA Synopsis of some recent tactical application of bioisosteres in drug design. J Med Chem 54:2529-91 (2011)  
Target
Name:
Angiotensin-converting enzyme
Synonyms:
ACE Angiotensin converting enzyme (ACE) Angiotensin-converting enzyme, soluble form CD_antigen=CD143 DCP1 Kininase II
Type:
Enzyme
Mol. Mass.:
149709.01
Organism:
Homo sapiens (Human)
Description:
Residue:
1306
  
Inhibitor
Name:
BDBM50146423
Synonyms:
(S)-1-{(R)-3-[((S)-1-Benzoylamino-2-phenyl-ethyl)-dihydroxy-silanyl]-2-methyl-propionyl}-pyrrolidine-2-carboxylic acid | CHEMBL328814
Type:
Small organic molecule
Emp. Form.:
C24H30N2O6Si
Mol. Mass.:
470.5903
SMILES:
C[C@@H](C[Si](O)(O)[C@@H](Cc1ccccc1)NC(=O)c1ccccc1)C(=O)N1CCC[C@H]1C(O)=O
: