Target
Fatty-acid amide hydrolase 1
Ligand
BDBM50374375
Substrate
Meas. Tech.
ChEMBL_879293 (CHEMBL2208691)
Ki
30±n/a nM
Citation
 Meanwell, NA Synopsis of some recent tactical application of bioisosteres in drug design. J Med Chem 54:2529-91 (2011)  
Target
Name:
Fatty-acid amide hydrolase 1
Synonyms:
Anandamide amidohydrolase FAAH FAAH1_HUMAN Fatty-acid amide hydrolase (FAAH) Oleamide hydrolase 1
Type:
Protein
Mol. Mass.:
63071.19
Organism:
Homo sapiens (Human)
Description:
O00519
Residue:
579
  
Inhibitor
Name:
BDBM50374375
Synonyms:
CHEMBL373906
Type:
Small organic molecule
Emp. Form.:
C16H18FNO2
Mol. Mass.:
275.318
SMILES:
Fc1cnc(o1)C(=O)CCCCCCc1ccccc1
: