Target
Type-2 angiotensin II receptor
Ligand
BDBM50282416
Substrate
Meas. Tech.
ChEMBL_879302 (CHEMBL2208700)
IC50
2±n/a nM
Citation
 Meanwell, NA Synopsis of some recent tactical application of bioisosteres in drug design. J Med Chem 54:2529-91 (2011)  
Target
Name:
Type-2 angiotensin II receptor
Synonyms:
AGTR2 AT2 Angiotensin II type 2 (AT-2) receptor Type-2 angiotensin II receptor
Type:
Enzyme Catalytic Domain
Mol. Mass.:
41201.61
Organism:
Homo sapiens (Human)
Description:
Angiotensin II, central 0 0::P50052
Residue:
363
  
Inhibitor
Name:
BDBM50282416
Synonyms:
3-(2'-Benzoylsulfamoyl-biphenyl-4-ylmethyl)-2-butyl-5-chloro-3H-imidazole-4-carboxylic acid | CHEMBL165354
Type:
Small organic molecule
Emp. Form.:
C28H26ClN3O5S
Mol. Mass.:
552.041
SMILES:
CCCCc1nc(Cl)c(C(O)=O)n1Cc1ccc(cc1)-c1ccccc1S(=O)(=O)NC(=O)c1ccccc1
: