Target
Type-2 angiotensin II receptor
Ligand
BDBM50003399
Substrate
Meas. Tech.
ChEMBL_879302 (CHEMBL2208700)
IC50
200±n/a nM
Citation
 Meanwell, NA Synopsis of some recent tactical application of bioisosteres in drug design. J Med Chem 54:2529-91 (2011)  
Target
Name:
Type-2 angiotensin II receptor
Synonyms:
AGTR2 AT2 Angiotensin II type 2 (AT-2) receptor Type-2 angiotensin II receptor
Type:
Enzyme Catalytic Domain
Mol. Mass.:
41201.61
Organism:
Homo sapiens (Human)
Description:
Angiotensin II, central 0 0::P50052
Residue:
363
  
Inhibitor
Name:
BDBM50003399
Synonyms:
4'-(2-Butyl-4-chloro-5-hydroxymethyl-imidazol-1-ylmethyl)-biphenyl-2-carboxylic acid 4-Chloro-5-hydroxymethyl-3-imidazol-1-ylmethyl-biphenyl-2-carboxylic acid butyl ester i4'-(2-Butyl-4-chloro-5-hydroxymethyl-imidazol-1-ylmethyl)-biphenyl-2-carboxylic acid | {2-Butyl-5-chloro-3-[2'-(2H-tetrazol-5-yl)-biphenyl-4-ylmethyl]-3H-imidazol-4-yl}-methanol (EXP7711 (IMI))
Type:
Small organic molecule
Emp. Form.:
C22H23ClN2O3
Mol. Mass.:
398.883
SMILES:
CCCCc1nc(Cl)c(CO)n1Cc1ccc(cc1)-c1ccccc1C(O)=O
: