Target
Substance-P receptor
Ligand
BDBM50224198
Substrate
Meas. Tech.
ChEMBL_879306 (CHEMBL2208704)
IC50
0.3±n/a nM
Citation
 Meanwell, NA Synopsis of some recent tactical application of bioisosteres in drug design. J Med Chem 54:2529-91 (2011)  
Target
Name:
Substance-P receptor
Synonyms:
NK-1 receptor NK1 Receptor NK1R_HUMAN Neurokinin-1 (NK-1) SPR TACR1 Tachykinin receptor 1 (NK1) | tachykinin
Type:
G Protein-Coupled Receptor (GPCR)
Mol. Mass.:
46254.43
Organism:
Homo sapiens (Human)
Description:
P25103
Residue:
407
  
Inhibitor
Name:
BDBM50224198
Synonyms:
(2S,3S)-N-(2-methoxy-5-(1,1,1-trifluoro-2-methylpropan-2-yl)benzyl)-2-phenylpiperidin-3-amine CHEMBL392368
Type:
Small organic molecule
Emp. Form.:
C23H29F3N2O
Mol. Mass.:
406.4844
SMILES:
COc1ccc(cc1CN[C@H]1CCCN[C@H]1c1ccccc1)C(C)(C)C(F)(F)F
: