Target
Poly [ADP-ribose] polymerase 1
Ligand
BDBM50154759
Substrate
Meas. Tech.
ChEMBL_879278 (CHEMBL2208631)
Ki
9.1±n/a nM
Citation
 Meanwell, NA Synopsis of some recent tactical application of bioisosteres in drug design. J Med Chem 54:2529-91 (2011)  
Target
Name:
Poly [ADP-ribose] polymerase 1
Synonyms:
(ARTD1 or PARP1) 2.4.2.30 ADPRT ARTD1 Human diphtheria toxin-like ADP-ribosyltransferase (ARTD1 or PARP1) NT-PARP-1 PARP1 PPOL Poly [ADP-ribose] polymerase 1 (PARP) Poly [ADP-ribose] polymerase 1 (PARP1) Poly [ADP-ribose] polymerase 1, 28-kDa form Poly [ADP-ribose] polymerase 1, processed C-terminus Poly [ADP-ribose] polymerase-1 Poly(ADP-ribose) polymerase-1 (ARTD1/PARP1) Protein poly-ADP-ribosyltransferase PARP1 | Synonyms=ADPRT
Type:
Mol. Mass.:
113114.22
Organism:
Homo sapiens (Human)
Description:
P09874
Residue:
1014
  
Inhibitor
Name:
BDBM50154759
Synonyms:
6-(4-Fluoro-phenyl)-7-(1-hydroxyimino-ethyl)-3,4-dihydro-2H-[1,4]diazepino[6,7,1-hi]indol-1-one CHEMBL362322
Type:
Small organic molecule
Emp. Form.:
C19H16FN3O2
Mol. Mass.:
337.3476
SMILES:
CC(N=O)c1c(-c2ccc(F)cc2)n2CCNC(=O)c3cccc1c23
: