Target
Prostaglandin G/H synthase 2
Ligand
BDBM50311392
Substrate
Meas. Tech.
ChEMBL_879287 (CHEMBL2208640)
IC50
120±n/a nM
Citation
 Meanwell, NA Synopsis of some recent tactical application of bioisosteres in drug design. J Med Chem 54:2529-91 (2011)  
Target
Name:
Prostaglandin G/H synthase 2
Synonyms:
COX2 Cyclooxygenase 2 (COX-2) Cyclooxygenase-2 (COX-2 AA) Cyclooxygenase-2 (COX-2) PGH2_HUMAN PHS II Prostaglandin E synthase/G/H synthase 2 Prostaglandin-endoperoxide synthase 2
Type:
Enzyme
Mol. Mass.:
69003.89
Organism:
Homo sapiens (Human)
Description:
Recombinant Cox-2 provided by Cayman (Cayman Chemical Co.,Ann Arbor, MI).
Residue:
604
  
Inhibitor
Name:
BDBM50311392
Synonyms:
CHEMBL1079335 | N-[3-(3-Bromophenylamino)-4-pyridinyl]trifluoromethanesulfonamide
Type:
Small organic molecule
Emp. Form.:
C12H9BrF3N3O2S
Mol. Mass.:
396.183
SMILES:
FC(F)(F)S(=O)(=O)Nc1ccncc1Nc1cccc(Br)c1
: