Target
Receptor tyrosine-protein kinase erbB-2
Ligand
BDBM50400863
Substrate
Meas. Tech.
ChEMBL_879289 (CHEMBL2208642)
IC50
590±n/a nM
Citation
 Meanwell, NA Synopsis of some recent tactical application of bioisosteres in drug design. J Med Chem 54:2529-91 (2011)  
Target
Name:
Receptor tyrosine-protein kinase erbB-2
Synonyms:
2.7.10.1 CD_antigen=CD340 ERBB2_HUMAN FASN/HER2 HER2 MLN19 NEU Proto-oncogene Neu Tyrosine kinase-type cell surface receptor HER2 | p185erbB2
Type:
Mol. Mass.:
137894.47
Organism:
Homo sapiens (Human)
Description:
P04626
Residue:
1255
  
Inhibitor
Name:
BDBM50400863
Synonyms:
CHEMBL2205030
Type:
Small organic molecule
Emp. Form.:
C11H7BrN2O2S2
Mol. Mass.:
343.219
SMILES:
Brc1ccc(cc1)S1=NS(=O)(=O)c2cnccc12
: