Target
Cannabinoid receptor 1
Ligand
BDBM50401061
Substrate
Meas. Tech.
ChEMBL_882430 (CHEMBL2210669)
Ki
140±n/a nM
Citation
 Wiley, JLSmith, VJChen, JMartin, BRHuffman, JW Synthesis and pharmacology of 1-alkyl-3-(1-naphthoyl)indoles: steric and electronic effects of 4- and 8-halogenated naphthoyl substituents. Bioorg Med Chem 20:2067-81 (2012)  
Target
Name:
Cannabinoid receptor 1
Synonyms:
CANN6 CB-R CNR CNR1_HUMAN Cannabinoid receptor Cannabinoid receptor 1 (brain)
Type:
G Protein-Coupled Receptor (GPCR)
Mol. Mass.:
52868.96
Organism:
Homo sapiens (Human)
Description:
P21554
Residue:
472
  
Inhibitor
Name:
BDBM50401061
Synonyms:
CHEMBL2206836
Type:
Small organic molecule
Emp. Form.:
C22H18INO
Mol. Mass.:
439.2889
SMILES:
CCCn1cc(C(=O)c2ccc(I)c3ccccc23)c2ccccc12
: