Target
Neuromedin-K receptor
Ligand
BDBM50401083
Substrate
Meas. Tech.
ChEMBL_883449 (CHEMBL2215524)
Ki
2.9±n/a nM
Citation
 Bissantz, CBohnert, CHoffmann, TMarcuz, ASchnider, PMalherbe, P Identification of a crucial amino acid in the helix position 6.51 of human tachykinin neurokinin 1 and 3 receptors contributing to the insurmountable mode of antagonism by dual NK1/NK3 antagonists. J Med Chem 55:5061-76 (2012)  
Target
Name:
Neuromedin-K receptor
Synonyms:
NK-3 receptor NK3R NKR Neurokinin B receptor Neuromedin-3 receptor (NK-3R) Neuromedin-K receptor Neuromedin-K receptor (NK3) TAC3R Tachykinin receptor 3 | Tachykinin receptor 3 (NK3)
Type:
Enzyme
Mol. Mass.:
52221.96
Organism:
Homo sapiens (Human)
Description:
P29371
Residue:
465
  
Inhibitor
Name:
BDBM50401083
Synonyms:
CHEMBL2203703
Type:
Small organic molecule
Emp. Form.:
C30H30F7N3O3
Mol. Mass.:
613.5663
SMILES:
CN(C(=O)C(C)(C)c1cc(cc(c1)C(F)(F)F)C(F)(F)F)c1cnc(cc1-c1ccc(F)cc1C)N1CC[C@H](O)[C@H]1CO
: