Target
Heat shock protein HSP 90-alpha
Ligand
BDBM50401333
Substrate
Meas. Tech.
ChEMBL_883814 (CHEMBL2212191)
IC50
1.1±n/a nM
Citation
Target
Name:
Heat shock protein HSP 90-alpha
Synonyms:
HS90A_HUMAN HSP86 HSP90AA1 HSPCA Heat shock 86 kDa Heat shock protein HSP 90-alpha (HSP90) LAP-2 Lipopolysaccharide-associated protein 2 heat shock protein 90kDa alpha (cytosolic), class A member 1 isoform 2
Type:
Molecular Chaperone
Mol. Mass.:
84623.45
Organism:
Homo sapiens (Human)
Description:
P07900
Residue:
732
  
Inhibitor
Name:
BDBM50401333
Synonyms:
CHEMBL1230584
Type:
Small organic molecule
Emp. Form.:
C21H24ClN5O2
Mol. Mass.:
413.901
SMILES:
COc1c(C)cnc(Cn2cc(C#CCC(C)(C)O)c3c(Cl)nc(N)nc23)c1C
: