Target
Sodium-dependent serotonin transporter
Ligand
BDBM50401403
Substrate
Meas. Tech.
ChEMBL_881850 (CHEMBL2211559)
Ki
3512±n/a nM
Citation
 Mattsson, CAndreasson, TWaters, NSonesson, C Systematic in vivo screening of a series of 1-propyl-4-arylpiperidines against dopaminergic and serotonergic properties in rat brain: a scaffold-jumping approach. J Med Chem 55:9735-50 (2012)  
Target
Name:
Sodium-dependent serotonin transporter
Synonyms:
5-HT Transporter 5HTT SC6A4_HUMAN SLC6A4 Serotonin transporter (5HTT) Sodium-dependent serotonin transporter (SERT) | Solute carrier family 6 member 4
Type:
Multi-pass membrane protein
Mol. Mass.:
70322.51
Organism:
Homo sapiens (Human)
Description:
P31645
Residue:
630
  
Inhibitor
Name:
BDBM50401403
Synonyms:
CHEMBL2207493
Type:
Small organic molecule
Emp. Form.:
C15H20ClN3O
Mol. Mass.:
293.792
SMILES:
CCCN1CCC(CC1)n1c2ccc(Cl)cc2[nH]c1=O
: